# Ansible tower installation error !!

**URL:** <https://forum.ansible.com/t/ansible-tower-installation-error/30827>\
**Category:** Ansible Project\
**Tags:** awx\
**Created:** [July 20, 2019, 1:53pm UTC](https://forum.ansible.com/t/ansible-tower-installation-error/30827 "2019-07-20T13:53:46Z")\
**Posts on this page:** 3\
**Page:** 1

<div class="post-metadata">

**Author:** ![aditya\_singh](https://avatars.discourse-cdn.com/v4/letter/a/b487fb/32.png) [@aditya\_singh](https://forum.ansible.com/u/aditya_singh)\
**Post date:** [July 20, 2019, 1:53pm UTC](https://forum.ansible.com/t/ansible-tower-installation-error/30827/1 "2019-07-20T13:53:46Z")

</div>

Hi recently i was trying to install Tower in centos7 bu t iam getting a error during the time of installation / Can i get some help ???

The Error I’m getting is this :

TASK [awx\_install : Migrate the Tower database schema (may take awhile when upgrading).] \*\*\*\*\*\*\*\*\*\*\*\*\*\*\*\*\*\*\*\*\*\*\*\*\*\*\*\*\*\*\*\*\*\*\*\*\*\*\*\*\*\*\*\*\*\*\*\*\*\*\*\*\*\*\*\*\*\*\*\*\*\*\*\*\*\*\*\*\*\*\*\*\*\*\*\*\*\*\*\*\*\*\*\*\*\*\*\*\*\*\*\*\*\*\*\*\*\*\*\*  
fatal: [localhost]: FAILED! =\> {“changed”: true, “cmd”: [“awx-manage”, “migrate”, “–noinput”], “delta”: “0:00:04.740891”, “end”: “2019-07-20 19:18:57.200241”, “msg”: “non-zero return code”, “rc”: 1, “start”: “2019-07-20 19:18:52.459350”, “stderr”: “Traceback (most recent call last):\n File "/var/lib/awx/venv/awx/lib64/python3.6/site-packages/django/db/backends/base/base.py", line 213, in ensure\_connection\n self.connect()\n File "/var/lib/awx/venv/awx/lib64/python3.6/site-packages/django/db/backends/base/base.py", line 189, in connect\n self.connection = self.get\_new\_connection(conn\_params)\n File "/var/lib/awx/venv/awx/lib64/python3.6/site-packages/django/db/backends/postgresql/base.py", line 176, in get\_new\_connection\n connection = Database.connect(\*\*conn\_params)\n File "/var/lib/awx/venv/awx/lib64/python3.6/site-packages/psycopg2/ **init**.py", line 130, in connect\n conn = \_connect(dsn, connection\_factory=connection\_factory, \*\*kwasync)\npsycopg2.OperationalError: fe\_sendauth: no password supplied\n\n\nThe above exception was the direct cause of the following exception:\n\nTraceback (most recent call last):\n File "/settings.py", line 91, in \_ctit\_db\_wrapper\n File "/settings.py", line 447, in **getattr** \n File "/settings.py", line 363, in \_get\_local\n File "/settings.py", line 325, in \_preload\_cache\n File "/var/lib/awx/venv/awx/lib64/python3.6/site-packages/django/db/models/query.py", line 250, in **iter** \n self.\_fetch\_all()\n File "/var/lib/awx/venv/awx/lib64/python3.6/site-packages/django/db/models/query.py", line 1121, in \_fetch\_all\n self.\_result\_cache = list(self.\_iterable\_class(self))\n File "/var/lib/awx/venv/awx/lib64/python3.6/site-packages/django/db/models/query.py", line 53, in **iter** \n results = compiler.execute\_sql(chunked\_fetch=self.chunked\_fetch)\n File "/var/lib/awx/venv/awx/lib64/python3.6/site-packages/django/db/models/sql/compiler.py", line 887, in execute\_sql\n cursor = self.connection.cursor()\n File "/var/lib/awx/venv/awx/lib64/python3.6/site-packages/django/db/backends/base/base.py", line 254, in cursor\n return self.\_cursor()\n File "/var/lib/awx/venv/awx/lib64/python3.6/site-packages/django/db/backends/base/base.py", line 229, in \_cursor\n self.ensure\_connection()\n File "/var/lib/awx/venv/awx/lib64/python3.6/site-packages/django/db/backends/base/base.py", line 213, in ensure\_connection\n self.connect()\n File "/var/lib/awx/venv/awx/lib64/python3.6/site-packages/django/db/utils.py", line 94, in **exit** \n six.reraise(dj\_exc\_type, dj\_exc\_value, traceback)\n File "/var/lib/awx/venv/awx/lib64/python3.6/site-packages/django/utils/six.py", line 685, in reraise\n raise value.with\_traceback(tb)\n File "/var/lib/awx/venv/awx/lib64/python3.6/site-packages/django/db/backends/base/base.py", line 213, in ensure\_connection\n self.connect()\n File "/var/lib/awx/venv/awx/lib64/python3.6/site-packages/django/db/backends/base/base.py", line 189, in connect\n self.connection = self.get\_new\_connection(conn\_params)\n File "/var/lib/awx/venv/awx/lib64/python3.6/site-packages/django/db/backends/postgresql/base.py", line 176, in get\_new\_connection\n connection = Database.connect(\*\*conn\_params)\n File "/var/lib/awx/venv/awx/lib64/python3.6/site-packages/psycopg2/ **init**.py", line 130, in connect\n conn = \_connect(dsn, connection\_factory=connection\_factory, \*\*kwasync)\ndjango.db.utils.OperationalError: fe\_sendauth: no password supplied\n\n\nDuring handling of the above exception, another exception occurred:\n\nTraceback (most recent call last):\n File "/var/lib/awx/venv/awx/lib64/python3.6/site-packages/django/db/backends/base/base.py", line 213, in ensure\_connection\n self.connect()\n File "/var/lib/awx/venv/awx/lib64/python3.6/site-packages/django/db/backends/base/base.py", line 189, in connect\n self.connection = self.get\_new\_connection(conn\_params)\n File "/var/lib/awx/venv/awx/lib64/python3.6/site-packages/django/db/backends/postgresql/base.py", line 176, in get\_new\_connection\n connection = Database.connect(\*\*conn\_params)\n File "/var/lib/awx/venv/awx/lib64/python3.6/site-packages/psycopg2/ **init**.py", line 130, in connect\n conn = \_connect(dsn, connection\_factory=connection\_factory, \*\*kwasync)\npsycopg2.OperationalError: fe\_sendauth: no password supplied\n\n\nThe above exception was the direct cause of the following exception:\n\nTraceback (most recent call last):\n File "/bin/awx-manage", line 11, in \n load\_entry\_point(‘awx==3.5.1’, ‘console\_scripts’, ‘awx-manage’)()\n File "/ **init**.py", line 140, in manage\n File "/var/lib/awx/venv/awx/lib64/python3.6/site-packages/django/core/management/ **init**.py", line 364, in execute\_from\_command\_line\n utility.execute()\n File "/var/lib/awx/venv/awx/lib64/python3.6/site-packages/django/core/management/ **init**.py", line 356, in execute\n self.fetch\_command(subcommand).run\_from\_argv(self.argv)\n File "/var/lib/awx/venv/awx/lib64/python3.6/site-packages/django/core/management/base.py", line 283, in run\_from\_argv\n self.execute(\*args, \*\*cmd\_options)\n File "/var/lib/awx/venv/awx/lib64/python3.6/site-packages/django/core/management/base.py", line 327, in execute\n self.check()\n File "/var/lib/awx/venv/awx/lib64/python3.6/site-packages/django/core/management/base.py", line 359, in check\n include\_deployment\_checks=include\_deployment\_checks,\n File "/var/lib/awx/venv/awx/lib64/python3.6/site-packages/django/core/management/commands/migrate.py", line 62, in \_run\_checks\n issues.extend(super(Command, self).\_run\_checks(\*\*kwargs))\n File "/var/lib/awx/venv/awx/lib64/python3.6/site-packages/django/core/management/base.py", line 346, in \_run\_checks\n return checks.run\_checks(\*\*kwargs)\n File "/var/lib/awx/venv/awx/lib64/python3.6/site-packages/django/core/checks/registry.py", line 81, in run\_checks\n new\_errors = check(app\_configs=app\_configs)\n File "/var/lib/awx/venv/awx/lib64/python3.6/site-packages/django/core/checks/urls.py", line 16, in check\_url\_config\n return check\_resolver(resolver)\n File "/var/lib/awx/venv/awx/lib64/python3.6/site-packages/django/core/checks/urls.py", line 26, in check\_resolver\n return check\_method()\n File "/var/lib/awx/venv/awx/lib64/python3.6/site-packages/django/urls/resolvers.py", line 256, in check\n for pattern in self.url\_patterns:\n File "/var/lib/awx/venv/awx/lib64/python3.6/site-packages/django/utils/functional.py", line 35, in **get** \n res = instance. **dict** [self.name] = self.func(instance)\n File "/var/lib/awx/venv/awx/lib64/python3.6/site-packages/django/urls/resolvers.py", line 407, in url\_patterns\n patterns = getattr(self.urlconf\_module, "urlpatterns", self.urlconf\_module)\n File "/var/lib/awx/venv/awx/lib64/python3.6/site-packages/django/utils/functional.py", line 35, in **get** \n res = instance. **dict** [self.name] = self.func(instance)\n File "/var/lib/awx/venv/awx/lib64/python3.6/site-packages/django/urls/resolvers.py", line 400, in urlconf\_module\n return import\_module(self.urlconf\_name)\n File "/opt/rh/rh-python36/root/usr/lib64/python3.6/importlib/ **init**.py", line 126, in import\_module\n return \_bootstrap.\_gcd\_import(name[level:], package, level)\n File "", line 994, in \_gcd\_import\n File "", line 971, in \_find\_and\_load\n File "", line 955, in \_find\_and\_load\_unlocked\n File "", line 665, in \_load\_unlocked\n File "", line 678, in exec\_module\n File "", line 219, in \_call\_with\_frames\_removed\n File "/urls.py", line 17, in \n File "/var/lib/awx/venv/awx/lib64/python3.6/site-packages/django/conf/urls/ **init**.py", line 50, in include\n urlconf\_module = import\_module(urlconf\_module)\n File "/opt/rh/rh-python36/root/usr/lib64/python3.6/importlib/ **init**.py", line 126, in import\_module\n return \_bootstrap.\_gcd\_import(name[level:], package, level)\n File "", line 994, in \_gcd\_import\n File "", line 971, in \_find\_and\_load\n File "", line 955, in \_find\_and\_load\_unlocked\n File "", line 665, in \_load\_unlocked\n File "", line 678, in exec\_module\n File "", line 219, in \_call\_with\_frames\_removed\n File "/var/lib/awx/venv/awx/lib64/python3.6/site-packages/social\_django/urls.py", line 6, in \n from . import views\n File "/var/lib/awx/venv/awx/lib64/python3.6/site-packages/social\_django/views.py", line 10, in \n from .utils import psa\n File "/var/lib/awx/venv/awx/lib64/python3.6/site-packages/social\_django/utils.py", line 13, in \n BACKENDS = settings.AUTHENTICATION\_BACKENDS\n File "/settings.py", line 543, in **getattr\_without\_cache** \n File "/settings.py", line 447, in **getattr** \n File "/opt/rh/rh-python36/root/usr/lib64/python3.6/contextlib.py", line 99, in **exit** \n self.gen.throw(type, value, traceback)\n File "/settings.py", line 93, in \_ctit\_db\_wrapper\n File "/db.py", line 14, in get\_tower\_migration\_version\n File "/var/lib/awx/venv/awx/lib64/python3.6/site-packages/django/db/migrations/loader.py", line 52, in **init** \n self.build\_graph()\n File "/var/lib/awx/venv/awx/lib64/python3.6/site-packages/django/db/migrations/loader.py", line 210, in build\_graph\n self.applied\_migrations = recorder.applied\_migrations()\n File "/var/lib/awx/venv/awx/lib64/python3.6/site-packages/django/db/migrations/recorder.py", line 65, in applied\_migrations\n self.ensure\_schema()\n File "/var/lib/awx/venv/awx/lib64/python3.6/site-packages/django/db/migrations/recorder.py", line 52, in ensure\_schema\n if self.Migration.\_meta.db\_table in self.connection.introspection.table\_names(self.connection.cursor()):\n File "/var/lib/awx/venv/awx/lib64/python3.6/site-packages/django/db/backends/base/base.py", line 254, in cursor\n return self.\_cursor()\n File "/var/lib/awx/venv/awx/lib64/python3.6/site-packages/django/db/backends/base/base.py", line 229, in \_cursor\n self.ensure\_connection()\n File "/var/lib/awx/venv/awx/lib64/python3.6/site-packages/django/db/backends/base/base.py", line 213, in ensure\_connection\n self.connect()\n File "/var/lib/awx/venv/awx/lib64/python3.6/site-packages/django/db/utils.py", line 94, in **exit** \n six.reraise(dj\_exc\_type, dj\_exc\_value, traceback)\n File "/var/lib/awx/venv/awx/lib64/python3.6/site-packages/django/utils/six.py", line 685, in reraise\n raise value.with\_traceback(tb)\n File "/var/lib/awx/venv/awx/lib64/python3.6/site-packages/django/db/backends/base/base.py", line 213, in ensure\_connection\n self.connect()\n File "/var/lib/awx/venv/awx/lib64/python3.6/site-packages/django/db/backends/base/base.py", line 189, in connect\n self.connection = self.get\_new\_connection(conn\_params)\n File "/var/lib/awx/venv/awx/lib64/python3.6/site-packages/django/db/backends/postgresql/base.py", line 176, in get\_new\_connection\n connection = Database.connect(\*\*conn\_params)\n File "/var/lib/awx/venv/awx/lib64/python3.6/site-packages/psycopg2/ **init**.py", line 130, in connect\n conn = \_connect(dsn, connection\_factory=connection\_factory, \*\*kwasync)\ndjango.db.utils.OperationalError: fe\_sendauth: no password supplied”, “stderr\_lines”: [“Traceback (most recent call last):”, " File "/var/lib/awx/venv/awx/lib64/python3.6/site-packages/django/db/backends/base/base.py", line 213, in ensure\_connection", " self.connect()“, " File "/var/lib/awx/venv/awx/lib64/python3.6/site-packages/django/db/backends/base/base.py", line 189, in connect”, " self.connection = self.get\_new\_connection(conn\_params)“, " File "/var/lib/awx/venv/awx/lib64/python3.6/site-packages/django/db/backends/postgresql/base.py", line 176, in get\_new\_connection”, " connection = Database.connect(\*\*conn\_params)“, " File "/var/lib/awx/venv/awx/lib64/python3.6/site-packages/psycopg2/ **init**.py", line 130, in connect”, " conn = \_connect(dsn, connection\_factory=connection\_factory, \*\*kwasync)“, “psycopg2.OperationalError: fe\_sendauth: no password supplied”, “”, “”, “The above exception was the direct cause of the following exception:”, “”, “Traceback (most recent call last):”, " File "/settings.py", line 91, in \_ctit\_db\_wrapper”, " File "/settings.py", line 447, in **getattr**", " File "/settings.py", line 363, in \_get\_local", " File "/settings.py", line 325, in \_preload\_cache", " File "/var/lib/awx/venv/awx/lib64/python3.6/site-packages/django/db/models/query.py", line 250, in **iter**", " self.\_fetch\_all()“, " File "/var/lib/awx/venv/awx/lib64/python3.6/site-packages/django/db/models/query.py", line 1121, in \_fetch\_all”, " self.\_result\_cache = list(self.\_iterable\_class(self))“, " File "/var/lib/awx/venv/awx/lib64/python3.6/site-packages/django/db/models/query.py", line 53, in **iter** ”, " results = compiler.execute\_sql(chunked\_fetch=self.chunked\_fetch)“, " File "/var/lib/awx/venv/awx/lib64/python3.6/site-packages/django/db/models/sql/compiler.py", line 887, in execute\_sql”, " cursor = self.connection.cursor()“, " File "/var/lib/awx/venv/awx/lib64/python3.6/site-packages/django/db/backends/base/base.py", line 254, in cursor”, " return self.\_cursor()“, " File "/var/lib/awx/venv/awx/lib64/python3.6/site-packages/django/db/backends/base/base.py", line 229, in \_cursor”, " self.ensure\_connection()“, " File "/var/lib/awx/venv/awx/lib64/python3.6/site-packages/django/db/backends/base/base.py", line 213, in ensure\_connection”, " self.connect()“, " File "/var/lib/awx/venv/awx/lib64/python3.6/site-packages/django/db/utils.py", line 94, in **exit** ”, " six.reraise(dj\_exc\_type, dj\_exc\_value, traceback)“, " File "/var/lib/awx/venv/awx/lib64/python3.6/site-packages/django/utils/six.py", line 685, in reraise”, " raise value.with\_traceback(tb)“, " File "/var/lib/awx/venv/awx/lib64/python3.6/site-packages/django/db/backends/base/base.py", line 213, in ensure\_connection”, " self.connect()“, " File "/var/lib/awx/venv/awx/lib64/python3.6/site-packages/django/db/backends/base/base.py", line 189, in connect”, " self.connection = self.get\_new\_connection(conn\_params)“, " File "/var/lib/awx/venv/awx/lib64/python3.6/site-packages/django/db/backends/postgresql/base.py", line 176, in get\_new\_connection”, " connection = Database.connect(\*\*conn\_params)“, " File "/var/lib/awx/venv/awx/lib64/python3.6/site-packages/psycopg2/ **init**.py", line 130, in connect”, " conn = \_connect(dsn, connection\_factory=connection\_factory, \*\*kwasync)“, “django.db.utils.OperationalError: fe\_sendauth: no password supplied”, “”, “”, “During handling of the above exception, another exception occurred:”, “”, “Traceback (most recent call last):”, " File "/var/lib/awx/venv/awx/lib64/python3.6/site-packages/django/db/backends/base/base.py", line 213, in ensure\_connection”, " self.connect()“, " File "/var/lib/awx/venv/awx/lib64/python3.6/site-packages/django/db/backends/base/base.py", line 189, in connect”, " self.connection = self.get\_new\_connection(conn\_params)“, " File "/var/lib/awx/venv/awx/lib64/python3.6/site-packages/django/db/backends/postgresql/base.py", line 176, in get\_new\_connection”, " connection = Database.connect(\*\*conn\_params)“, " File "/var/lib/awx/venv/awx/lib64/python3.6/site-packages/psycopg2/ **init**.py", line 130, in connect”, " conn = \_connect(dsn, connection\_factory=connection\_factory, \*\*kwasync)“, “psycopg2.OperationalError: fe\_sendauth: no password supplied”, “”, “”, “The above exception was the direct cause of the following exception:”, “”, “Traceback (most recent call last):”, " File "/bin/awx-manage", line 11, in ”, " load\_entry\_point(‘awx==3.5.1’, ‘console\_scripts’, ‘awx-manage’)()“, " File "/ **init**.py", line 140, in manage”, " File "/var/lib/awx/venv/awx/lib64/python3.6/site-packages/django/core/management/ **init**.py", line 364, in execute\_from\_command\_line", " utility.execute()“, " File "/var/lib/awx/venv/awx/lib64/python3.6/site-packages/django/core/management/ **init**.py", line 356, in execute”, " self.fetch\_command(subcommand).run\_from\_argv(self.argv)“, " File "/var/lib/awx/venv/awx/lib64/python3.6/site-packages/django/core/management/base.py", line 283, in run\_from\_argv”, " self.execute(\*args, \*\*cmd\_options)“, " File "/var/lib/awx/venv/awx/lib64/python3.6/site-packages/django/core/management/base.py", line 327, in execute”, " self.check()“, " File "/var/lib/awx/venv/awx/lib64/python3.6/site-packages/django/core/management/base.py", line 359, in check”, " include\_deployment\_checks=include\_deployment\_checks,“, " File "/var/lib/awx/venv/awx/lib64/python3.6/site-packages/django/core/management/commands/migrate.py", line 62, in \_run\_checks”, " issues.extend(super(Command, self).\_run\_checks(\*\*kwargs))“, " File "/var/lib/awx/venv/awx/lib64/python3.6/site-packages/django/core/management/base.py", line 346, in \_run\_checks”, " return checks.run\_checks(\*\*kwargs)“, " File "/var/lib/awx/venv/awx/lib64/python3.6/site-packages/django/core/checks/registry.py", line 81, in run\_checks”, " new\_errors = check(app\_configs=app\_configs)“, " File "/var/lib/awx/venv/awx/lib64/python3.6/site-packages/django/core/checks/urls.py", line 16, in check\_url\_config”, " return check\_resolver(resolver)“, " File "/var/lib/awx/venv/awx/lib64/python3.6/site-packages/django/core/checks/urls.py", line 26, in check\_resolver”, " return check\_method()“, " File "/var/lib/awx/venv/awx/lib64/python3.6/site-packages/django/urls/resolvers.py", line 256, in check”, " for pattern in self.url\_patterns:“, " File "/var/lib/awx/venv/awx/lib64/python3.6/site-packages/django/utils/functional.py", line 35, in **get** ”, " res = instance. **dict** [self.name] = self.func(instance)“, " File "/var/lib/awx/venv/awx/lib64/python3.6/site-packages/django/urls/resolvers.py", line 407, in url\_patterns”, " patterns = getattr(self.urlconf\_module, "urlpatterns", self.urlconf\_module)“, " File "/var/lib/awx/venv/awx/lib64/python3.6/site-packages/django/utils/functional.py", line 35, in **get** ”, " res = instance. **dict** [self.name] = self.func(instance)“, " File "/var/lib/awx/venv/awx/lib64/python3.6/site-packages/django/urls/resolvers.py", line 400, in urlconf\_module”, " return import\_module(self.urlconf\_name)“, " File "/opt/rh/rh-python36/root/usr/lib64/python3.6/importlib/ **init**.py", line 126, in import\_module”, " return \_bootstrap.\_gcd\_import(name[level:], package, level)“, " File "", line 994, in \_gcd\_import”, " File "", line 971, in \_find\_and\_load", " File "", line 955, in \_find\_and\_load\_unlocked", " File "", line 665, in \_load\_unlocked", " File "", line 678, in exec\_module", " File "", line 219, in \_call\_with\_frames\_removed", " File "/urls.py", line 17, in “, " File "/var/lib/awx/venv/awx/lib64/python3.6/site-packages/django/conf/urls/ **init**.py", line 50, in include”, " urlconf\_module = import\_module(urlconf\_module)“, " File "/opt/rh/rh-python36/root/usr/lib64/python3.6/importlib/ **init**.py", line 126, in import\_module”, " return \_bootstrap.\_gcd\_import(name[level:], package, level)“, " File "", line 994, in \_gcd\_import”, " File "", line 971, in \_find\_and\_load", " File "", line 955, in \_find\_and\_load\_unlocked", " File "", line 665, in \_load\_unlocked", " File "", line 678, in exec\_module", " File "", line 219, in \_call\_with\_frames\_removed", " File "/var/lib/awx/venv/awx/lib64/python3.6/site-packages/social\_django/urls.py", line 6, in “, " from . import views”, " File "/var/lib/awx/venv/awx/lib64/python3.6/site-packages/social\_django/views.py", line 10, in “, " from .utils import psa”, " File "/var/lib/awx/venv/awx/lib64/python3.6/site-packages/social\_django/utils.py", line 13, in “, " BACKENDS = settings.AUTHENTICATION\_BACKENDS”, " File "/settings.py", line 543, in **getattr\_without\_cache**", " File "/settings.py", line 447, in **getattr**", " File "/opt/rh/rh-python36/root/usr/lib64/python3.6/contextlib.py", line 99, in **exit**", " self.gen.throw(type, value, traceback)“, " File "/settings.py", line 93, in \_ctit\_db\_wrapper”, " File "/db.py", line 14, in get\_tower\_migration\_version", " File "/var/lib/awx/venv/awx/lib64/python3.6/site-packages/django/db/migrations/loader.py", line 52, in **init**", " self.build\_graph()“, " File "/var/lib/awx/venv/awx/lib64/python3.6/site-packages/django/db/migrations/loader.py", line 210, in build\_graph”, " self.applied\_migrations = recorder.applied\_migrations()“, " File "/var/lib/awx/venv/awx/lib64/python3.6/site-packages/django/db/migrations/recorder.py", line 65, in applied\_migrations”, " self.ensure\_schema()“, " File "/var/lib/awx/venv/awx/lib64/python3.6/site-packages/django/db/migrations/recorder.py", line 52, in ensure\_schema”, " if self.Migration.\_meta.db\_table in self.connection.introspection.table\_names(self.connection.cursor()):“, " File "/var/lib/awx/venv/awx/lib64/python3.6/site-packages/django/db/backends/base/base.py", line 254, in cursor”, " return self.\_cursor()“, " File "/var/lib/awx/venv/awx/lib64/python3.6/site-packages/django/db/backends/base/base.py", line 229, in \_cursor”, " self.ensure\_connection()“, " File "/var/lib/awx/venv/awx/lib64/python3.6/site-packages/django/db/backends/base/base.py", line 213, in ensure\_connection”, " self.connect()“, " File "/var/lib/awx/venv/awx/lib64/python3.6/site-packages/django/db/utils.py", line 94, in **exit** ”, " six.reraise(dj\_exc\_type, dj\_exc\_value, traceback)“, " File "/var/lib/awx/venv/awx/lib64/python3.6/site-packages/django/utils/six.py", line 685, in reraise”, " raise value.with\_traceback(tb)“, " File "/var/lib/awx/venv/awx/lib64/python3.6/site-packages/django/db/backends/base/base.py", line 213, in ensure\_connection”, " self.connect()“, " File "/var/lib/awx/venv/awx/lib64/python3.6/site-packages/django/db/backends/base/base.py", line 189, in connect”, " self.connection = self.get\_new\_connection(conn\_params)“, " File "/var/lib/awx/venv/awx/lib64/python3.6/site-packages/django/db/backends/postgresql/base.py", line 176, in get\_new\_connection”, " connection = Database.connect(\*\*conn\_params)“, " File "/var/lib/awx/venv/awx/lib64/python3.6/site-packages/psycopg2/ **init**.py", line 130, in connect”, " conn = \_connect(dsn, connection\_factory=connection\_factory, \*\*kwasync)", “django.db.utils.OperationalError: fe\_sendauth: no password supplied”], “stdout”: “”, “stdout\_lines”: }

PLAY RECAP \*\*\*\*\*\*\*\*\*\*\*\*\*\*\*\*\*\*\*\*\*\*\*\*\*\*\*\*\*\*\*\*\*\*\*\*\*\*\*\*\*\*\*\*\*\*\*\*\*\*\*\*\*\*\*\*\*\*\*\*\*\*\*\*\*\*\*\*\*\*\*\*\*\*\*\*\*\*\*\*\*\*\*\*\*\*\*\*\*\*\*\*\*\*\*\*\*\*\*\*\*\*\*\*\*\*\*\*\*\*\*\*\*\*\*\*\*\*\*\*\*\*\*\*\*\*\*\*\*\*\*\*\*\*\*\*\*\*\*\*\*\*\*\*\*\*\*\*\*\*\*\*\*\*\*\*\*\*\*\*\*\*\*\*\*\*\*\*\*\*\*\*\*\*\*\*\*\*  
localhost : ok=106 changed=11 unreachable=0 failed=1 skipped=59 rescued=0 ignored=0

---

<div class="post-metadata">

**Author:** ![Jonathan\_Lozada\_De\_L](https://avatars.discourse-cdn.com/v4/letter/j/eb8c5e/32.png) [@Jonathan\_Lozada\_De\_L](https://forum.ansible.com/u/Jonathan_Lozada_De_L)\
**Post date:** [July 20, 2019, 1:55pm UTC](https://forum.ansible.com/t/ansible-tower-installation-error/30827/2 "2019-07-20T13:55:09Z")

</div>

please resch out to support. This is for ansible.

Jonathan Lozada De La Matta on mobile

– You received this message because you are subscribed to the Google Groups “Ansible Project” group. To unsubscribe from this group and stop receiving emails from it, send an email to . To view this discussion on the web visit .

---

<div class="post-metadata">

**Author:** ![Ankit2](https://avatars.discourse-cdn.com/v4/letter/a/ea5d25/32.png) [@Ankit2](https://forum.ansible.com/u/Ankit2)\
**Post date:** [July 20, 2019, 3:31pm UTC](https://forum.ansible.com/t/ansible-tower-installation-error/30827/3 "2019-07-20T15:31:53Z")

</div>

Try validating the error: **_no password supplied_**.
